CRAN Package Check Results for Package GMLTM

Last updated on 2026-10-15 21:52:53 CEST.

Flavor Version Tinstall Tcheck Ttotal Status Flags
r-devel-linux-x86_64-debian-clang 2.0.0 10.57 1183.25 1193.82 OK
r-devel-linux-x86_64-debian-gcc 2.0.0 9.62 1344.55 1354.17 OK
r-devel-linux-x86_64-fedora-clang 2.0.0 10.00 412.71 422.71 OK
r-devel-linux-x86_64-fedora-gcc 2.0.0 10.00 565.11 575.11 OK
r-devel-windows-x86_64 2.0.0 15.00 281.00 296.00 ERROR
r-patched-linux-x86_64 2.0.0 16.59 1326.61 1343.20 OK
r-release-linux-x86_64 2.0.0 10.11 1269.76 1279.87 OK
r-release-macos-arm64 2.0.0 3.00 148.00 151.00 OK
r-release-macos-x86_64 2.0.0 10.00 677.00 687.00 OK
r-release-windows-x86_64 2.0.0 14.00 274.00 288.00 ERROR
r-oldrel-macos-arm64 2.0.0 3.00 163.00 166.00 OK
r-oldrel-macos-x86_64 2.0.0 10.00 653.00 663.00 OK
r-oldrel-windows-x86_64 2.0.0 22.00 348.00 370.00 ERROR

Check Details

Version: 2.0.0
Check: tests
Result: ERROR Running 'testthat.R' [160s] Running the tests in 'tests/testthat.R' failed. Complete output: > library(testthat) > library(GMLTM) > test_check("GMLTM") specified C++17 make cmd is make -f "D:/RCompile/recent/R/etc/x64/Makeconf" -f "D:/RCompile/recent/R/share/make/winshlib.mk" CXX='$(CXX17) $(CXX17STD)' CXXFLAGS='$(CXX17FLAGS)' CXXPICFLAGS='$(CXX17PICFLAGS)' SHLIB_LDFLAGS='$(SHLIB_CXX17LDFLAGS)' SHLIB_LD='$(SHLIB_CXX17LD)' SHLIB="file38c143aec2d6d.dll" WIN=64 TCLBIN= OBJECTS="file38c143aec2d6d.o" make would use make[1]: Entering directory '/d/temp/2026_10_12_01_50_00_23142/RtmpcbfimM' g++ -std=gnu++17 -I"D:/RCompile/recent/R/include" -DNDEBUG -I"D:/RCompile/CRANpkg/lib/4.7/Rcpp/include/" -I"D:/temp/2026_10_12_01_50_00_23142/Rtmpwfgfqe/RLIBS_3e03c49cc60bf/RcppEigen/include/" -I"D:/temp/2026_10_12_01_50_00_23142/Rtmpwfgfqe/RLIBS_3e03c49cc60bf/RcppEigen/include/unsupported" -I"D:/temp/2026_10_12_01_50_00_23142/Rtmpwfgfqe/RLIBS_3e03c49cc60bf/BH/include" -I"D:/RCompile/CRANpkg/lib/4.7/StanHeaders/include/src/" -I"D:/RCompile/CRANpkg/lib/4.7/StanHeaders/include/" -I"D:/RCompile/CRANpkg/lib/4.7/RcppParallel/include/" -DRCPP_PARALLEL_USE_TBB=1 -DTBB_INTERFACE_NEW -ID:/RCompile/CRANpkg/lib/4.7/RcppParallel/include -I"D:/RCompile/CRANpkg/lib/4.7/rstan/include" -DEIGEN_NO_DEBUG -DBOOST_DISABLE_ASSERTS -DBOOST_PENDING_INTEGER_LOG2_HPP -DSTAN_THREADS -DUSE_STANC3 -DSTRICT_R_HEADERS -DBOOST_PHOENIX_NO_VARIADIC_EXPRESSION -D_HAS_AUTO_PTR_ETC=0 -include "D:/RCompile/CRANpkg/lib/4.7/StanHeaders/include/stan/math/prim/fun/Eigen.hpp" -std=c++1y -I"d:/rtools45/x86_64-w64-mingw32.static.posix/include" -O2 -Wall -mfpmath=sse -msse2 -mstackrealign -c file38c143aec2d6d.cpp -o file38c143aec2d6d.o if test "zfile38c143aec2d6d.o" != "z"; then \ if test -e "file38c143aec2d6d-win.def"; then \ echo g++ -shared -s -static-libgcc -o file38c143aec2d6d.dll file38c143aec2d6d-win.def file38c143aec2d6d.o "D:/RCompile/CRANpkg/lib/4.7/rstan/lib/x64/libStanServices.a" -L"D:/RCompile/CRANpkg/lib/4.7/StanHeaders/libs/x64" -lStanHeaders -L"D:/RCompile/CRANpkg/lib/4.7/RcppParallel/lib/x64" -ltbb -LD:/RCompile/CRANpkg/lib/4.7/RcppParallel/libs/x64 -lRcppParallel -LD:/RCompile/CRANpkg/lib/4.7/RcppParallel/lib/x64 -ltbb -ltbbmalloc -L"d:/rtools45/x86_64-w64-mingw32.static.posix/lib/x64" -L"d:/rtools45/x86_64-w64-mingw32.static.posix/lib" -L"D:/RCompile/recent/R/bin/x64" -lR ; \ g++ -shared -s -static-libgcc -o file38c143aec2d6d.dll file38c143aec2d6d-win.def file38c143aec2d6d.o "D:/RCompile/CRANpkg/lib/4.7/rstan/lib/x64/libStanServices.a" -L"D:/RCompile/CRANpkg/lib/4.7/StanHeaders/libs/x64" -lStanHeaders -L"D:/RCompile/CRANpkg/lib/4.7/RcppParallel/lib/x64" -ltbb -LD:/RCompile/CRANpkg/lib/4.7/RcppParallel/libs/x64 -lRcppParallel -LD:/RCompile/CRANpkg/lib/4.7/RcppParallel/lib/x64 -ltbb -ltbbmalloc -L"d:/rtools45/x86_64-w64-mingw32.static.posix/lib/x64" -L"d:/rtools45/x86_64-w64-mingw32.static.posix/lib" -L"D:/RCompile/recent/R/bin/x64" -lR ; \ else \ echo EXPORTS > tmp.def; \ nm file38c143aec2d6d.o | sed -n 's/^.* [BCDRT] / /p' | sed -e '/[.]refptr[.]/d' -e '/[.]weak[.]/d' | sed 's/[^ ][^ ]*/"&"/g' >> tmp.def; \ echo g++ -shared -s -static-libgcc -o file38c143aec2d6d.dll tmp.def file38c143aec2d6d.o "D:/RCompile/CRANpkg/lib/4.7/rstan/lib/x64/libStanServices.a" -L"D:/RCompile/CRANpkg/lib/4.7/StanHeaders/libs/x64" -lStanHeaders -L"D:/RCompile/CRANpkg/lib/4.7/RcppParallel/lib/x64" -ltbb -LD:/RCompile/CRANpkg/lib/4.7/RcppParallel/libs/x64 -lRcppParallel -LD:/RCompile/CRANpkg/lib/4.7/RcppParallel/lib/x64 -ltbb -ltbbmalloc -L"d:/rtools45/x86_64-w64-mingw32.static.posix/lib/x64" -L"d:/rtools45/x86_64-w64-mingw32.static.posix/lib" -L"D:/RCompile/recent/R/bin/x64" -lR ; \ g++ -shared -s -static-libgcc -o file38c143aec2d6d.dll tmp.def file38c143aec2d6d.o "D:/RCompile/CRANpkg/lib/4.7/rstan/lib/x64/libStanServices.a" -L"D:/RCompile/CRANpkg/lib/4.7/StanHeaders/libs/x64" -lStanHeaders -L"D:/RCompile/CRANpkg/lib/4.7/RcppParallel/lib/x64" -ltbb -LD:/RCompile/CRANpkg/lib/4.7/RcppParallel/libs/x64 -lRcppParallel -LD:/RCompile/CRANpkg/lib/4.7/RcppParallel/lib/x64 -ltbb -ltbbmalloc -L"d:/rtools45/x86_64-w64-mingw32.static.posix/lib/x64" -L"d:/rtools45/x86_64-w64-mingw32.static.posix/lib" -L"D:/RCompile/recent/R/bin/x64" -lR ; \ rm -f tmp.def; \ fi \ fi make[1]: Leaving directory '/d/temp/2026_10_12_01_50_00_23142/RtmpcbfimM' Saving _problems/test-data-input-64.R specified C++17 make cmd is make -f "D:/RCompile/recent/R/etc/x64/Makeconf" -f "D:/RCompile/recent/R/share/make/winshlib.mk" CXX='$(CXX17) $(CXX17STD)' CXXFLAGS='$(CXX17FLAGS)' CXXPICFLAGS='$(CXX17PICFLAGS)' SHLIB_LDFLAGS='$(SHLIB_CXX17LDFLAGS)' SHLIB_LD='$(SHLIB_CXX17LD)' SHLIB="file38c141549352f.dll" WIN=64 TCLBIN= OBJECTS="file38c141549352f.o" make would use make[1]: Entering directory '/d/temp/2026_10_12_01_50_00_23142/RtmpcbfimM' g++ -std=gnu++17 -I"D:/RCompile/recent/R/include" -DNDEBUG -I"D:/RCompile/CRANpkg/lib/4.7/Rcpp/include/" -I"D:/temp/2026_10_12_01_50_00_23142/Rtmpwfgfqe/RLIBS_3e03c49cc60bf/RcppEigen/include/" -I"D:/temp/2026_10_12_01_50_00_23142/Rtmpwfgfqe/RLIBS_3e03c49cc60bf/RcppEigen/include/unsupported" -I"D:/temp/2026_10_12_01_50_00_23142/Rtmpwfgfqe/RLIBS_3e03c49cc60bf/BH/include" -I"D:/RCompile/CRANpkg/lib/4.7/StanHeaders/include/src/" -I"D:/RCompile/CRANpkg/lib/4.7/StanHeaders/include/" -I"D:/RCompile/CRANpkg/lib/4.7/RcppParallel/include/" -DRCPP_PARALLEL_USE_TBB=1 -DTBB_INTERFACE_NEW -ID:/RCompile/CRANpkg/lib/4.7/RcppParallel/include -I"D:/RCompile/CRANpkg/lib/4.7/rstan/include" -DEIGEN_NO_DEBUG -DBOOST_DISABLE_ASSERTS -DBOOST_PENDING_INTEGER_LOG2_HPP -DSTAN_THREADS -DUSE_STANC3 -DSTRICT_R_HEADERS -DBOOST_PHOENIX_NO_VARIADIC_EXPRESSION -D_HAS_AUTO_PTR_ETC=0 -include "D:/RCompile/CRANpkg/lib/4.7/StanHeaders/include/stan/math/prim/fun/Eigen.hpp" -std=c++1y -I"d:/rtools45/x86_64-w64-mingw32.static.posix/include" -O2 -Wall -mfpmath=sse -msse2 -mstackrealign -c file38c141549352f.cpp -o file38c141549352f.o if test "zfile38c141549352f.o" != "z"; then \ if test -e "file38c141549352f-win.def"; then \ echo g++ -shared -s -static-libgcc -o file38c141549352f.dll file38c141549352f-win.def file38c141549352f.o "D:/RCompile/CRANpkg/lib/4.7/rstan/lib/x64/libStanServices.a" -L"D:/RCompile/CRANpkg/lib/4.7/StanHeaders/libs/x64" -lStanHeaders -L"D:/RCompile/CRANpkg/lib/4.7/RcppParallel/lib/x64" -ltbb -LD:/RCompile/CRANpkg/lib/4.7/RcppParallel/libs/x64 -lRcppParallel -LD:/RCompile/CRANpkg/lib/4.7/RcppParallel/lib/x64 -ltbb -ltbbmalloc -L"d:/rtools45/x86_64-w64-mingw32.static.posix/lib/x64" -L"d:/rtools45/x86_64-w64-mingw32.static.posix/lib" -L"D:/RCompile/recent/R/bin/x64" -lR ; \ g++ -shared -s -static-libgcc -o file38c141549352f.dll file38c141549352f-win.def file38c141549352f.o "D:/RCompile/CRANpkg/lib/4.7/rstan/lib/x64/libStanServices.a" -L"D:/RCompile/CRANpkg/lib/4.7/StanHeaders/libs/x64" -lStanHeaders -L"D:/RCompile/CRANpkg/lib/4.7/RcppParallel/lib/x64" -ltbb -LD:/RCompile/CRANpkg/lib/4.7/RcppParallel/libs/x64 -lRcppParallel -LD:/RCompile/CRANpkg/lib/4.7/RcppParallel/lib/x64 -ltbb -ltbbmalloc -L"d:/rtools45/x86_64-w64-mingw32.static.posix/lib/x64" -L"d:/rtools45/x86_64-w64-mingw32.static.posix/lib" -L"D:/RCompile/recent/R/bin/x64" -lR ; \ else \ echo EXPORTS > tmp.def; \ nm file38c141549352f.o | sed -n 's/^.* [BCDRT] / /p' | sed -e '/[.]refptr[.]/d' -e '/[.]weak[.]/d' | sed 's/[^ ][^ ]*/"&"/g' >> tmp.def; \ echo g++ -shared -s -static-libgcc -o file38c141549352f.dll tmp.def file38c141549352f.o "D:/RCompile/CRANpkg/lib/4.7/rstan/lib/x64/libStanServices.a" -L"D:/RCompile/CRANpkg/lib/4.7/StanHeaders/libs/x64" -lStanHeaders -L"D:/RCompile/CRANpkg/lib/4.7/RcppParallel/lib/x64" -ltbb -LD:/RCompile/CRANpkg/lib/4.7/RcppParallel/libs/x64 -lRcppParallel -LD:/RCompile/CRANpkg/lib/4.7/RcppParallel/lib/x64 -ltbb -ltbbmalloc -L"d:/rtools45/x86_64-w64-mingw32.static.posix/lib/x64" -L"d:/rtools45/x86_64-w64-mingw32.static.posix/lib" -L"D:/RCompile/recent/R/bin/x64" -lR ; \ g++ -shared -s -static-libgcc -o file38c141549352f.dll tmp.def file38c141549352f.o "D:/RCompile/CRANpkg/lib/4.7/rstan/lib/x64/libStanServices.a" -L"D:/RCompile/CRANpkg/lib/4.7/StanHeaders/libs/x64" -lStanHeaders -L"D:/RCompile/CRANpkg/lib/4.7/RcppParallel/lib/x64" -ltbb -LD:/RCompile/CRANpkg/lib/4.7/RcppParallel/libs/x64 -lRcppParallel -LD:/RCompile/CRANpkg/lib/4.7/RcppParallel/lib/x64 -ltbb -ltbbmalloc -L"d:/rtools45/x86_64-w64-mingw32.static.posix/lib/x64" -L"d:/rtools45/x86_64-w64-mingw32.static.posix/lib" -L"D:/RCompile/recent/R/bin/x64" -lR ; \ rm -f tmp.def; \ fi \ fi make[1]: Leaving directory '/d/temp/2026_10_12_01_50_00_23142/RtmpcbfimM' Saving _problems/test-priors-50.R [ FAIL 4 | WARN 0 | SKIP 0 | PASS 84 ] ══ Failed tests ════════════════════════════════════════════════════════════════ ── Error ('test-data-input.R:60:3'): fitting with a plain matrix runs end to end without error (all four models) ── Error in `compileCode(f, code, language = language, verbose = verbose)`: l = model38c1433393c97__namespace::model38c1433393c97_; BaseRNG = boost::random::additive_combine_engine<boost::random::linear_congruential_engine<unsigned int, 40014, 0, 2147483563>, boost::random::linear_congruential_engine<unsigned int, 40692, 0, 2147483399> >]' 22 | return 0.5 * z.p.transpose() * z.inv_e_metric_ * z.p; D:/RCompile/CRANpkg/lib/4.7/StanHeaders/include/src/stan/mcmc/hmc/hamiltonians/dense_e_metric.hpp:21:0: required from here 21 | double T(dense_e_point& z) { D:/RCompile/CRANpkg/lib/4.7/RcppEigen/include/Eigen/src/Core/DenseCoeffsBase.h:654:74: warning: ignoring attributes on template argument 'Eigen::internal::packet_traits<double>::type' {aka '__m128d'} [-Wignored-attributes] 654 | return internal::first_aligned<int(unpacket_traits<DefaultPacketType>::alignment),Derived>(m); | ^~~~~~~~~ make[1]: *** [D:/RCompile/recent/R/etc/x64/Makeconf:304: file38c143aec2d6d.o] Error 1 Backtrace: ▆ 1. ├─testthat::expect_s3_class(...) at test-data-input.R:60:3 2. │ └─testthat::quasi_label(enquo(object)) 3. │ └─rlang::eval_bare(expr, quo_get_env(quo)) 4. ├─base::suppressWarnings(...) 5. │ └─base::withCallingHandlers(...) 6. └─GMLTM::GMLTM(...) 7. └─rstan::stan_model(stan_file) 8. └─rstan:::cxxfunctionplus(...) 9. ├─pkgbuild::with_build_tools(...) 10. │ └─pkgbuild:::withr_with_path(rtools_path(), code) 11. │ └─base::force(code) 12. └─inline::cxxfunction(...) 13. └─inline:::compileCode(f, code, language = language, verbose = verbose) ── Error ('test-data-input.R:60:3'): fitting with a plain matrix runs end to end without error (all four models) ── Error in `sink(type = "output")`: invalid connection Backtrace: ▆ 1. ├─testthat::expect_s3_class(...) at test-data-input.R:60:3 2. │ └─testthat::quasi_label(enquo(object)) 3. │ └─rlang::eval_bare(expr, quo_get_env(quo)) 4. ├─base::suppressWarnings(...) 5. │ └─base::withCallingHandlers(...) 6. └─GMLTM::GMLTM(...) 7. └─rstan::stan_model(stan_file) 8. └─rstan:::cxxfunctionplus(...) 9. └─base::sink(type = "output") ── Error ('test-priors.R:46:3'): GMLTM fits successfully with priors$alpha$family = 'lognormal' ── Error in `compileCode(f, code, language = language, verbose = verbose)`: l = model38c145d2538a0__namespace::model38c145d2538a0_; BaseRNG = boost::random::additive_combine_engine<boost::random::linear_congruential_engine<unsigned int, 40014, 0, 2147483563>, boost::random::linear_congruential_engine<unsigned int, 40692, 0, 2147483399> >]' 22 | return 0.5 * z.p.transpose() * z.inv_e_metric_ * z.p; D:/RCompile/CRANpkg/lib/4.7/StanHeaders/include/src/stan/mcmc/hmc/hamiltonians/dense_e_metric.hpp:21:0: required from here 21 | double T(dense_e_point& z) { D:/RCompile/CRANpkg/lib/4.7/RcppEigen/include/Eigen/src/Core/DenseCoeffsBase.h:654:74: warning: ignoring attributes on template argument 'Eigen::internal::packet_traits<double>::type' {aka '__m128d'} [-Wignored-attributes] 654 | return internal::first_aligned<int(unpacket_traits<DefaultPacketType>::alignment),Derived>(m); | ^~~~~~~~~ make[1]: *** [D:/RCompile/recent/R/etc/x64/Makeconf:304: file38c141549352f.o] Error 1 Backtrace: ▆ 1. ├─base::suppressWarnings(...) at test-priors.R:46:3 2. │ └─base::withCallingHandlers(...) 3. └─GMLTM::GMLTM(...) 4. └─rstan::stan_model(stan_file) 5. └─rstan:::cxxfunctionplus(...) 6. ├─pkgbuild::with_build_tools(...) 7. │ └─pkgbuild:::withr_with_path(rtools_path(), code) 8. │ └─base::force(code) 9. └─inline::cxxfunction(...) 10. └─inline:::compileCode(f, code, language = language, verbose = verbose) ── Error ('test-priors.R:46:3'): GMLTM fits successfully with priors$alpha$family = 'lognormal' ── Error in `sink(type = "output")`: invalid connection Backtrace: ▆ 1. ├─base::suppressWarnings(...) at test-priors.R:46:3 2. │ └─base::withCallingHandlers(...) 3. └─GMLTM::GMLTM(...) 4. └─rstan::stan_model(stan_file) 5. └─rstan:::cxxfunctionplus(...) 6. └─base::sink(type = "output") [ FAIL 4 | WARN 0 | SKIP 0 | PASS 84 ] Error: ! Test failures. Execution halted Flavor: r-devel-windows-x86_64

Version: 2.0.0
Check: tests
Result: ERROR Running 'testthat.R' [155s] Running the tests in 'tests/testthat.R' failed. Complete output: > library(testthat) > library(GMLTM) > test_check("GMLTM") specified C++17 make cmd is make -f "D:/RCompile/recent/R-4.6.1/etc/x64/Makeconf" -f "D:/RCompile/recent/R-4.6.1/share/make/winshlib.mk" CXX='$(CXX17) $(CXX17STD)' CXXFLAGS='$(CXX17FLAGS)' CXXPICFLAGS='$(CXX17PICFLAGS)' SHLIB_LDFLAGS='$(SHLIB_CXX17LDFLAGS)' SHLIB_LD='$(SHLIB_CXX17LD)' SHLIB="file479a01e87136.dll" WIN=64 TCLBIN= OBJECTS="file479a01e87136.o" make would use make[1]: Entering directory '/d/temp/2026_10_11_01_50_00_3140/RtmpG2dqOZ' g++ -std=gnu++17 -I"D:/RCompile/recent/R-4.6.1/include" -DNDEBUG -I"D:/RCompile/CRANpkg/lib/4.6/Rcpp/include/" -I"D:/temp/2026_10_11_01_50_00_3140/RtmpIr6BU1/RLIBS_185d012b57b/RcppEigen/include/" -I"D:/temp/2026_10_11_01_50_00_3140/RtmpIr6BU1/RLIBS_185d012b57b/RcppEigen/include/unsupported" -I"D:/temp/2026_10_11_01_50_00_3140/RtmpIr6BU1/RLIBS_185d012b57b/BH/include" -I"D:/RCompile/CRANpkg/lib/4.6/StanHeaders/include/src/" -I"D:/RCompile/CRANpkg/lib/4.6/StanHeaders/include/" -I"D:/RCompile/CRANpkg/lib/4.6/RcppParallel/include/" -DRCPP_PARALLEL_USE_TBB=1 -DTBB_INTERFACE_NEW -ID:/RCompile/CRANpkg/lib/4.6/RcppParallel/include -I"D:/RCompile/CRANpkg/lib/4.6/rstan/include" -DEIGEN_NO_DEBUG -DBOOST_DISABLE_ASSERTS -DBOOST_PENDING_INTEGER_LOG2_HPP -DSTAN_THREADS -DUSE_STANC3 -DSTRICT_R_HEADERS -DBOOST_PHOENIX_NO_VARIADIC_EXPRESSION -D_HAS_AUTO_PTR_ETC=0 -include "D:/RCompile/CRANpkg/lib/4.6/StanHeaders/include/stan/math/prim/fun/Eigen.hpp" -std=c++1y -I"d:/rtools45/x86_64-w64-mingw32.static.posix/include" -O2 -Wall -mfpmath=sse -msse2 -mstackrealign -c file479a01e87136.cpp -o file479a01e87136.o if test "zfile479a01e87136.o" != "z"; then \ if test -e "file479a01e87136-win.def"; then \ echo g++ -shared -s -static-libgcc -o file479a01e87136.dll file479a01e87136-win.def file479a01e87136.o "D:/RCompile/CRANpkg/lib/4.6/rstan/lib/x64/libStanServices.a" -L"D:/RCompile/CRANpkg/lib/4.6/StanHeaders/libs/x64" -lStanHeaders -L"D:/RCompile/CRANpkg/lib/4.6/RcppParallel/lib/x64" -ltbb -LD:/RCompile/CRANpkg/lib/4.6/RcppParallel/libs/x64 -lRcppParallel -LD:/RCompile/CRANpkg/lib/4.6/RcppParallel/lib/x64 -ltbb -ltbbmalloc -L"d:/rtools45/x86_64-w64-mingw32.static.posix/lib/x64" -L"d:/rtools45/x86_64-w64-mingw32.static.posix/lib" -L"D:/RCompile/recent/R-4.6.1/bin/x64" -lR ; \ g++ -shared -s -static-libgcc -o file479a01e87136.dll file479a01e87136-win.def file479a01e87136.o "D:/RCompile/CRANpkg/lib/4.6/rstan/lib/x64/libStanServices.a" -L"D:/RCompile/CRANpkg/lib/4.6/StanHeaders/libs/x64" -lStanHeaders -L"D:/RCompile/CRANpkg/lib/4.6/RcppParallel/lib/x64" -ltbb -LD:/RCompile/CRANpkg/lib/4.6/RcppParallel/libs/x64 -lRcppParallel -LD:/RCompile/CRANpkg/lib/4.6/RcppParallel/lib/x64 -ltbb -ltbbmalloc -L"d:/rtools45/x86_64-w64-mingw32.static.posix/lib/x64" -L"d:/rtools45/x86_64-w64-mingw32.static.posix/lib" -L"D:/RCompile/recent/R-4.6.1/bin/x64" -lR ; \ else \ echo EXPORTS > tmp.def; \ nm file479a01e87136.o | sed -n 's/^.* [BCDRT] / /p' | sed -e '/[.]refptr[.]/d' -e '/[.]weak[.]/d' | sed 's/[^ ][^ ]*/"&"/g' >> tmp.def; \ echo g++ -shared -s -static-libgcc -o file479a01e87136.dll tmp.def file479a01e87136.o "D:/RCompile/CRANpkg/lib/4.6/rstan/lib/x64/libStanServices.a" -L"D:/RCompile/CRANpkg/lib/4.6/StanHeaders/libs/x64" -lStanHeaders -L"D:/RCompile/CRANpkg/lib/4.6/RcppParallel/lib/x64" -ltbb -LD:/RCompile/CRANpkg/lib/4.6/RcppParallel/libs/x64 -lRcppParallel -LD:/RCompile/CRANpkg/lib/4.6/RcppParallel/lib/x64 -ltbb -ltbbmalloc -L"d:/rtools45/x86_64-w64-mingw32.static.posix/lib/x64" -L"d:/rtools45/x86_64-w64-mingw32.static.posix/lib" -L"D:/RCompile/recent/R-4.6.1/bin/x64" -lR ; \ g++ -shared -s -static-libgcc -o file479a01e87136.dll tmp.def file479a01e87136.o "D:/RCompile/CRANpkg/lib/4.6/rstan/lib/x64/libStanServices.a" -L"D:/RCompile/CRANpkg/lib/4.6/StanHeaders/libs/x64" -lStanHeaders -L"D:/RCompile/CRANpkg/lib/4.6/RcppParallel/lib/x64" -ltbb -LD:/RCompile/CRANpkg/lib/4.6/RcppParallel/libs/x64 -lRcppParallel -LD:/RCompile/CRANpkg/lib/4.6/RcppParallel/lib/x64 -ltbb -ltbbmalloc -L"d:/rtools45/x86_64-w64-mingw32.static.posix/lib/x64" -L"d:/rtools45/x86_64-w64-mingw32.static.posix/lib" -L"D:/RCompile/recent/R-4.6.1/bin/x64" -lR ; \ rm -f tmp.def; \ fi \ fi make[1]: Leaving directory '/d/temp/2026_10_11_01_50_00_3140/RtmpG2dqOZ' Saving _problems/test-data-input-64.R specified C++17 make cmd is make -f "D:/RCompile/recent/R-4.6.1/etc/x64/Makeconf" -f "D:/RCompile/recent/R-4.6.1/share/make/winshlib.mk" CXX='$(CXX17) $(CXX17STD)' CXXFLAGS='$(CXX17FLAGS)' CXXPICFLAGS='$(CXX17PICFLAGS)' SHLIB_LDFLAGS='$(SHLIB_CXX17LDFLAGS)' SHLIB_LD='$(SHLIB_CXX17LD)' SHLIB="file479a02cb2610e.dll" WIN=64 TCLBIN= OBJECTS="file479a02cb2610e.o" make would use make[1]: Entering directory '/d/temp/2026_10_11_01_50_00_3140/RtmpG2dqOZ' g++ -std=gnu++17 -I"D:/RCompile/recent/R-4.6.1/include" -DNDEBUG -I"D:/RCompile/CRANpkg/lib/4.6/Rcpp/include/" -I"D:/temp/2026_10_11_01_50_00_3140/RtmpIr6BU1/RLIBS_185d012b57b/RcppEigen/include/" -I"D:/temp/2026_10_11_01_50_00_3140/RtmpIr6BU1/RLIBS_185d012b57b/RcppEigen/include/unsupported" -I"D:/temp/2026_10_11_01_50_00_3140/RtmpIr6BU1/RLIBS_185d012b57b/BH/include" -I"D:/RCompile/CRANpkg/lib/4.6/StanHeaders/include/src/" -I"D:/RCompile/CRANpkg/lib/4.6/StanHeaders/include/" -I"D:/RCompile/CRANpkg/lib/4.6/RcppParallel/include/" -DRCPP_PARALLEL_USE_TBB=1 -DTBB_INTERFACE_NEW -ID:/RCompile/CRANpkg/lib/4.6/RcppParallel/include -I"D:/RCompile/CRANpkg/lib/4.6/rstan/include" -DEIGEN_NO_DEBUG -DBOOST_DISABLE_ASSERTS -DBOOST_PENDING_INTEGER_LOG2_HPP -DSTAN_THREADS -DUSE_STANC3 -DSTRICT_R_HEADERS -DBOOST_PHOENIX_NO_VARIADIC_EXPRESSION -D_HAS_AUTO_PTR_ETC=0 -include "D:/RCompile/CRANpkg/lib/4.6/StanHeaders/include/stan/math/prim/fun/Eigen.hpp" -std=c++1y -I"d:/rtools45/x86_64-w64-mingw32.static.posix/include" -O2 -Wall -mfpmath=sse -msse2 -mstackrealign -c file479a02cb2610e.cpp -o file479a02cb2610e.o if test "zfile479a02cb2610e.o" != "z"; then \ if test -e "file479a02cb2610e-win.def"; then \ echo g++ -shared -s -static-libgcc -o file479a02cb2610e.dll file479a02cb2610e-win.def file479a02cb2610e.o "D:/RCompile/CRANpkg/lib/4.6/rstan/lib/x64/libStanServices.a" -L"D:/RCompile/CRANpkg/lib/4.6/StanHeaders/libs/x64" -lStanHeaders -L"D:/RCompile/CRANpkg/lib/4.6/RcppParallel/lib/x64" -ltbb -LD:/RCompile/CRANpkg/lib/4.6/RcppParallel/libs/x64 -lRcppParallel -LD:/RCompile/CRANpkg/lib/4.6/RcppParallel/lib/x64 -ltbb -ltbbmalloc -L"d:/rtools45/x86_64-w64-mingw32.static.posix/lib/x64" -L"d:/rtools45/x86_64-w64-mingw32.static.posix/lib" -L"D:/RCompile/recent/R-4.6.1/bin/x64" -lR ; \ g++ -shared -s -static-libgcc -o file479a02cb2610e.dll file479a02cb2610e-win.def file479a02cb2610e.o "D:/RCompile/CRANpkg/lib/4.6/rstan/lib/x64/libStanServices.a" -L"D:/RCompile/CRANpkg/lib/4.6/StanHeaders/libs/x64" -lStanHeaders -L"D:/RCompile/CRANpkg/lib/4.6/RcppParallel/lib/x64" -ltbb -LD:/RCompile/CRANpkg/lib/4.6/RcppParallel/libs/x64 -lRcppParallel -LD:/RCompile/CRANpkg/lib/4.6/RcppParallel/lib/x64 -ltbb -ltbbmalloc -L"d:/rtools45/x86_64-w64-mingw32.static.posix/lib/x64" -L"d:/rtools45/x86_64-w64-mingw32.static.posix/lib" -L"D:/RCompile/recent/R-4.6.1/bin/x64" -lR ; \ else \ echo EXPORTS > tmp.def; \ nm file479a02cb2610e.o | sed -n 's/^.* [BCDRT] / /p' | sed -e '/[.]refptr[.]/d' -e '/[.]weak[.]/d' | sed 's/[^ ][^ ]*/"&"/g' >> tmp.def; \ echo g++ -shared -s -static-libgcc -o file479a02cb2610e.dll tmp.def file479a02cb2610e.o "D:/RCompile/CRANpkg/lib/4.6/rstan/lib/x64/libStanServices.a" -L"D:/RCompile/CRANpkg/lib/4.6/StanHeaders/libs/x64" -lStanHeaders -L"D:/RCompile/CRANpkg/lib/4.6/RcppParallel/lib/x64" -ltbb -LD:/RCompile/CRANpkg/lib/4.6/RcppParallel/libs/x64 -lRcppParallel -LD:/RCompile/CRANpkg/lib/4.6/RcppParallel/lib/x64 -ltbb -ltbbmalloc -L"d:/rtools45/x86_64-w64-mingw32.static.posix/lib/x64" -L"d:/rtools45/x86_64-w64-mingw32.static.posix/lib" -L"D:/RCompile/recent/R-4.6.1/bin/x64" -lR ; \ g++ -shared -s -static-libgcc -o file479a02cb2610e.dll tmp.def file479a02cb2610e.o "D:/RCompile/CRANpkg/lib/4.6/rstan/lib/x64/libStanServices.a" -L"D:/RCompile/CRANpkg/lib/4.6/StanHeaders/libs/x64" -lStanHeaders -L"D:/RCompile/CRANpkg/lib/4.6/RcppParallel/lib/x64" -ltbb -LD:/RCompile/CRANpkg/lib/4.6/RcppParallel/libs/x64 -lRcppParallel -LD:/RCompile/CRANpkg/lib/4.6/RcppParallel/lib/x64 -ltbb -ltbbmalloc -L"d:/rtools45/x86_64-w64-mingw32.static.posix/lib/x64" -L"d:/rtools45/x86_64-w64-mingw32.static.posix/lib" -L"D:/RCompile/recent/R-4.6.1/bin/x64" -lR ; \ rm -f tmp.def; \ fi \ fi make[1]: Leaving directory '/d/temp/2026_10_11_01_50_00_3140/RtmpG2dqOZ' Saving _problems/test-priors-50.R [ FAIL 4 | WARN 0 | SKIP 0 | PASS 84 ] ══ Failed tests ════════════════════════════════════════════════════════════════ ── Error ('test-data-input.R:60:3'): fitting with a plain matrix runs end to end without error (all four models) ── Error in `compileCode(f, code, language = language, verbose = verbose)`: odel479a06d43517e__namespace::model479a06d43517e_; BaseRNG = boost::random::additive_combine_engine<boost::random::linear_congruential_engine<unsigned int, 40014, 0, 2147483563>, boost::random::linear_congruential_engine<unsigned int, 40692, 0, 2147483399> >]' 22 | return 0.5 * z.p.transpose() * z.inv_e_metric_ * z.p; D:/RCompile/CRANpkg/lib/4.6/StanHeaders/include/src/stan/mcmc/hmc/hamiltonians/dense_e_metric.hpp:21:0: required from here 21 | double T(dense_e_point& z) { D:/RCompile/CRANpkg/lib/4.6/RcppEigen/include/Eigen/src/Core/DenseCoeffsBase.h:654:74: warning: ignoring attributes on template argument 'Eigen::internal::packet_traits<double>::type' {aka '__m128d'} [-Wignored-attributes] 654 | return internal::first_aligned<int(unpacket_traits<DefaultPacketType>::alignment),Derived>(m); | ^~~~~~~~~ make[1]: *** [D:/RCompile/recent/R-4.6.1/etc/x64/Makeconf:304: file479a01e87136.o] Error 1 Backtrace: ▆ 1. ├─testthat::expect_s3_class(...) at test-data-input.R:60:3 2. │ └─testthat::quasi_label(enquo(object)) 3. │ └─rlang::eval_bare(expr, quo_get_env(quo)) 4. ├─base::suppressWarnings(...) 5. │ └─base::withCallingHandlers(...) 6. └─GMLTM::GMLTM(...) 7. └─rstan::stan_model(stan_file) 8. └─rstan:::cxxfunctionplus(...) 9. ├─pkgbuild::with_build_tools(...) 10. │ └─pkgbuild:::withr_with_path(rtools_path(), code) 11. │ └─base::force(code) 12. └─inline::cxxfunction(...) 13. └─inline:::compileCode(f, code, language = language, verbose = verbose) ── Error ('test-data-input.R:60:3'): fitting with a plain matrix runs end to end without error (all four models) ── Error in `sink(type = "output")`: invalid connection Backtrace: ▆ 1. ├─testthat::expect_s3_class(...) at test-data-input.R:60:3 2. │ └─testthat::quasi_label(enquo(object)) 3. │ └─rlang::eval_bare(expr, quo_get_env(quo)) 4. ├─base::suppressWarnings(...) 5. │ └─base::withCallingHandlers(...) 6. └─GMLTM::GMLTM(...) 7. └─rstan::stan_model(stan_file) 8. └─rstan:::cxxfunctionplus(...) 9. └─base::sink(type = "output") ── Error ('test-priors.R:46:3'): GMLTM fits successfully with priors$alpha$family = 'lognormal' ── Error in `compileCode(f, code, language = language, verbose = verbose)`: model479a04f01c9f__namespace::model479a04f01c9f_; BaseRNG = boost::random::additive_combine_engine<boost::random::linear_congruential_engine<unsigned int, 40014, 0, 2147483563>, boost::random::linear_congruential_engine<unsigned int, 40692, 0, 2147483399> >]' 22 | return 0.5 * z.p.transpose() * z.inv_e_metric_ * z.p; D:/RCompile/CRANpkg/lib/4.6/StanHeaders/include/src/stan/mcmc/hmc/hamiltonians/dense_e_metric.hpp:21:0: required from here 21 | double T(dense_e_point& z) { D:/RCompile/CRANpkg/lib/4.6/RcppEigen/include/Eigen/src/Core/DenseCoeffsBase.h:654:74: warning: ignoring attributes on template argument 'Eigen::internal::packet_traits<double>::type' {aka '__m128d'} [-Wignored-attributes] 654 | return internal::first_aligned<int(unpacket_traits<DefaultPacketType>::alignment),Derived>(m); | ^~~~~~~~~ make[1]: *** [D:/RCompile/recent/R-4.6.1/etc/x64/Makeconf:304: file479a02cb2610e.o] Error 1 Backtrace: ▆ 1. ├─base::suppressWarnings(...) at test-priors.R:46:3 2. │ └─base::withCallingHandlers(...) 3. └─GMLTM::GMLTM(...) 4. └─rstan::stan_model(stan_file) 5. └─rstan:::cxxfunctionplus(...) 6. ├─pkgbuild::with_build_tools(...) 7. │ └─pkgbuild:::withr_with_path(rtools_path(), code) 8. │ └─base::force(code) 9. └─inline::cxxfunction(...) 10. └─inline:::compileCode(f, code, language = language, verbose = verbose) ── Error ('test-priors.R:46:3'): GMLTM fits successfully with priors$alpha$family = 'lognormal' ── Error in `sink(type = "output")`: invalid connection Backtrace: ▆ 1. ├─base::suppressWarnings(...) at test-priors.R:46:3 2. │ └─base::withCallingHandlers(...) 3. └─GMLTM::GMLTM(...) 4. └─rstan::stan_model(stan_file) 5. └─rstan:::cxxfunctionplus(...) 6. └─base::sink(type = "output") [ FAIL 4 | WARN 0 | SKIP 0 | PASS 84 ] Error: ! Test failures. Execution halted Flavor: r-release-windows-x86_64

Version: 2.0.0
Check: tests
Result: ERROR Running 'testthat.R' [204s] Running the tests in 'tests/testthat.R' failed. Complete output: > library(testthat) > library(GMLTM) > test_check("GMLTM") make cmd is make -f "D:/RCompile/recent/R-4.5.3/etc/x64/Makeconf" -f "D:/RCompile/recent/R-4.5.3/share/make/winshlib.mk" CXX='$(CXX17) $(CXX17STD)' CXXFLAGS='$(CXX17FLAGS)' CXXPICFLAGS='$(CXX17PICFLAGS)' SHLIB_LDFLAGS='$(SHLIB_CXX17LDFLAGS)' SHLIB_LD='$(SHLIB_CXX17LD)' SHLIB="file1a7d436b870c.dll" WIN=64 TCLBIN= OBJECTS="file1a7d436b870c.o" make would use make[1]: Entering directory '/d/temp/2026_10_14_01_50_00_30378/RtmpiMs6e9' g++ -std=gnu++17 -I"D:/RCompile/recent/R-4.5.3/include" -DNDEBUG -I"D:/RCompile/CRANpkg/lib/4.5/Rcpp/include/" -I"D:/temp/2026_10_14_01_50_00_30378/RtmpQ5E9Y4/RLIBS_3ef281f81761d/RcppEigen/include/" -I"D:/temp/2026_10_14_01_50_00_30378/RtmpQ5E9Y4/RLIBS_3ef281f81761d/RcppEigen/include/unsupported" -I"D:/temp/2026_10_14_01_50_00_30378/RtmpQ5E9Y4/RLIBS_3ef281f81761d/BH/include" -I"D:/RCompile/CRANpkg/lib/4.5/StanHeaders/include/src/" -I"D:/RCompile/CRANpkg/lib/4.5/StanHeaders/include/" -I"D:/RCompile/CRANpkg/lib/4.5/RcppParallel/include/" -DRCPP_PARALLEL_USE_TBB=1 -DTBB_INTERFACE_NEW -ID:/RCompile/CRANpkg/lib/4.5/RcppParallel/include -I"D:/RCompile/CRANpkg/lib/4.5/rstan/include" -DEIGEN_NO_DEBUG -DBOOST_DISABLE_ASSERTS -DBOOST_PENDING_INTEGER_LOG2_HPP -DSTAN_THREADS -DUSE_STANC3 -DSTRICT_R_HEADERS -DBOOST_PHOENIX_NO_VARIADIC_EXPRESSION -D_HAS_AUTO_PTR_ETC=0 -include "D:/RCompile/CRANpkg/lib/4.5/StanHeaders/include/stan/math/prim/fun/Eigen.hpp" -std=c++1y -I"d:/rtools45/x86_64-w64-mingw32.static.posix/include" -O2 -Wall -mfpmath=sse -msse2 -mstackrealign -c file1a7d436b870c.cpp -o file1a7d436b870c.o if test "zfile1a7d436b870c.o" != "z"; then \ if test -e "file1a7d436b870c-win.def"; then \ echo g++ -shared -s -static-libgcc -o file1a7d436b870c.dll file1a7d436b870c-win.def file1a7d436b870c.o "D:/RCompile/CRANpkg/lib/4.5/rstan/lib/x64/libStanServices.a" -L"D:/RCompile/CRANpkg/lib/4.5/StanHeaders/libs/x64" -lStanHeaders -L"D:/RCompile/CRANpkg/lib/4.5/RcppParallel/lib/x64" -ltbb -LD:/RCompile/CRANpkg/lib/4.5/RcppParallel/libs/x64 -lRcppParallel -LD:/RCompile/CRANpkg/lib/4.5/RcppParallel/lib/x64 -ltbb -ltbbmalloc -L"d:/rtools45/x86_64-w64-mingw32.static.posix/lib/x64" -L"d:/rtools45/x86_64-w64-mingw32.static.posix/lib" -L"D:/RCompile/recent/R-4.5.3/bin/x64" -lR ; \ g++ -shared -s -static-libgcc -o file1a7d436b870c.dll file1a7d436b870c-win.def file1a7d436b870c.o "D:/RCompile/CRANpkg/lib/4.5/rstan/lib/x64/libStanServices.a" -L"D:/RCompile/CRANpkg/lib/4.5/StanHeaders/libs/x64" -lStanHeaders -L"D:/RCompile/CRANpkg/lib/4.5/RcppParallel/lib/x64" -ltbb -LD:/RCompile/CRANpkg/lib/4.5/RcppParallel/libs/x64 -lRcppParallel -LD:/RCompile/CRANpkg/lib/4.5/RcppParallel/lib/x64 -ltbb -ltbbmalloc -L"d:/rtools45/x86_64-w64-mingw32.static.posix/lib/x64" -L"d:/rtools45/x86_64-w64-mingw32.static.posix/lib" -L"D:/RCompile/recent/R-4.5.3/bin/x64" -lR ; \ else \ echo EXPORTS > tmp.def; \ nm file1a7d436b870c.o | sed -n 's/^.* [BCDRT] / /p' | sed -e '/[.]refptr[.]/d' -e '/[.]weak[.]/d' | sed 's/[^ ][^ ]*/"&"/g' >> tmp.def; \ echo g++ -shared -s -static-libgcc -o file1a7d436b870c.dll tmp.def file1a7d436b870c.o "D:/RCompile/CRANpkg/lib/4.5/rstan/lib/x64/libStanServices.a" -L"D:/RCompile/CRANpkg/lib/4.5/StanHeaders/libs/x64" -lStanHeaders -L"D:/RCompile/CRANpkg/lib/4.5/RcppParallel/lib/x64" -ltbb -LD:/RCompile/CRANpkg/lib/4.5/RcppParallel/libs/x64 -lRcppParallel -LD:/RCompile/CRANpkg/lib/4.5/RcppParallel/lib/x64 -ltbb -ltbbmalloc -L"d:/rtools45/x86_64-w64-mingw32.static.posix/lib/x64" -L"d:/rtools45/x86_64-w64-mingw32.static.posix/lib" -L"D:/RCompile/recent/R-4.5.3/bin/x64" -lR ; \ g++ -shared -s -static-libgcc -o file1a7d436b870c.dll tmp.def file1a7d436b870c.o "D:/RCompile/CRANpkg/lib/4.5/rstan/lib/x64/libStanServices.a" -L"D:/RCompile/CRANpkg/lib/4.5/StanHeaders/libs/x64" -lStanHeaders -L"D:/RCompile/CRANpkg/lib/4.5/RcppParallel/lib/x64" -ltbb -LD:/RCompile/CRANpkg/lib/4.5/RcppParallel/libs/x64 -lRcppParallel -LD:/RCompile/CRANpkg/lib/4.5/RcppParallel/lib/x64 -ltbb -ltbbmalloc -L"d:/rtools45/x86_64-w64-mingw32.static.posix/lib/x64" -L"d:/rtools45/x86_64-w64-mingw32.static.posix/lib" -L"D:/RCompile/recent/R-4.5.3/bin/x64" -lR ; \ rm -f tmp.def; \ fi \ fi make[1]: Leaving directory '/d/temp/2026_10_14_01_50_00_30378/RtmpiMs6e9' Saving _problems/test-data-input-64.R make cmd is make -f "D:/RCompile/recent/R-4.5.3/etc/x64/Makeconf" -f "D:/RCompile/recent/R-4.5.3/share/make/winshlib.mk" CXX='$(CXX17) $(CXX17STD)' CXXFLAGS='$(CXX17FLAGS)' CXXPICFLAGS='$(CXX17PICFLAGS)' SHLIB_LDFLAGS='$(SHLIB_CXX17LDFLAGS)' SHLIB_LD='$(SHLIB_CXX17LD)' SHLIB="file1a7d4180a5c6.dll" WIN=64 TCLBIN= OBJECTS="file1a7d4180a5c6.o" make would use make[1]: Entering directory '/d/temp/2026_10_14_01_50_00_30378/RtmpiMs6e9' g++ -std=gnu++17 -I"D:/RCompile/recent/R-4.5.3/include" -DNDEBUG -I"D:/RCompile/CRANpkg/lib/4.5/Rcpp/include/" -I"D:/temp/2026_10_14_01_50_00_30378/RtmpQ5E9Y4/RLIBS_3ef281f81761d/RcppEigen/include/" -I"D:/temp/2026_10_14_01_50_00_30378/RtmpQ5E9Y4/RLIBS_3ef281f81761d/RcppEigen/include/unsupported" -I"D:/temp/2026_10_14_01_50_00_30378/RtmpQ5E9Y4/RLIBS_3ef281f81761d/BH/include" -I"D:/RCompile/CRANpkg/lib/4.5/StanHeaders/include/src/" -I"D:/RCompile/CRANpkg/lib/4.5/StanHeaders/include/" -I"D:/RCompile/CRANpkg/lib/4.5/RcppParallel/include/" -DRCPP_PARALLEL_USE_TBB=1 -DTBB_INTERFACE_NEW -ID:/RCompile/CRANpkg/lib/4.5/RcppParallel/include -I"D:/RCompile/CRANpkg/lib/4.5/rstan/include" -DEIGEN_NO_DEBUG -DBOOST_DISABLE_ASSERTS -DBOOST_PENDING_INTEGER_LOG2_HPP -DSTAN_THREADS -DUSE_STANC3 -DSTRICT_R_HEADERS -DBOOST_PHOENIX_NO_VARIADIC_EXPRESSION -D_HAS_AUTO_PTR_ETC=0 -include "D:/RCompile/CRANpkg/lib/4.5/StanHeaders/include/stan/math/prim/fun/Eigen.hpp" -std=c++1y -I"d:/rtools45/x86_64-w64-mingw32.static.posix/include" -O2 -Wall -mfpmath=sse -msse2 -mstackrealign -c file1a7d4180a5c6.cpp -o file1a7d4180a5c6.o if test "zfile1a7d4180a5c6.o" != "z"; then \ if test -e "file1a7d4180a5c6-win.def"; then \ echo g++ -shared -s -static-libgcc -o file1a7d4180a5c6.dll file1a7d4180a5c6-win.def file1a7d4180a5c6.o "D:/RCompile/CRANpkg/lib/4.5/rstan/lib/x64/libStanServices.a" -L"D:/RCompile/CRANpkg/lib/4.5/StanHeaders/libs/x64" -lStanHeaders -L"D:/RCompile/CRANpkg/lib/4.5/RcppParallel/lib/x64" -ltbb -LD:/RCompile/CRANpkg/lib/4.5/RcppParallel/libs/x64 -lRcppParallel -LD:/RCompile/CRANpkg/lib/4.5/RcppParallel/lib/x64 -ltbb -ltbbmalloc -L"d:/rtools45/x86_64-w64-mingw32.static.posix/lib/x64" -L"d:/rtools45/x86_64-w64-mingw32.static.posix/lib" -L"D:/RCompile/recent/R-4.5.3/bin/x64" -lR ; \ g++ -shared -s -static-libgcc -o file1a7d4180a5c6.dll file1a7d4180a5c6-win.def file1a7d4180a5c6.o "D:/RCompile/CRANpkg/lib/4.5/rstan/lib/x64/libStanServices.a" -L"D:/RCompile/CRANpkg/lib/4.5/StanHeaders/libs/x64" -lStanHeaders -L"D:/RCompile/CRANpkg/lib/4.5/RcppParallel/lib/x64" -ltbb -LD:/RCompile/CRANpkg/lib/4.5/RcppParallel/libs/x64 -lRcppParallel -LD:/RCompile/CRANpkg/lib/4.5/RcppParallel/lib/x64 -ltbb -ltbbmalloc -L"d:/rtools45/x86_64-w64-mingw32.static.posix/lib/x64" -L"d:/rtools45/x86_64-w64-mingw32.static.posix/lib" -L"D:/RCompile/recent/R-4.5.3/bin/x64" -lR ; \ else \ echo EXPORTS > tmp.def; \ nm file1a7d4180a5c6.o | sed -n 's/^.* [BCDRT] / /p' | sed -e '/[.]refptr[.]/d' -e '/[.]weak[.]/d' | sed 's/[^ ][^ ]*/"&"/g' >> tmp.def; \ echo g++ -shared -s -static-libgcc -o file1a7d4180a5c6.dll tmp.def file1a7d4180a5c6.o "D:/RCompile/CRANpkg/lib/4.5/rstan/lib/x64/libStanServices.a" -L"D:/RCompile/CRANpkg/lib/4.5/StanHeaders/libs/x64" -lStanHeaders -L"D:/RCompile/CRANpkg/lib/4.5/RcppParallel/lib/x64" -ltbb -LD:/RCompile/CRANpkg/lib/4.5/RcppParallel/libs/x64 -lRcppParallel -LD:/RCompile/CRANpkg/lib/4.5/RcppParallel/lib/x64 -ltbb -ltbbmalloc -L"d:/rtools45/x86_64-w64-mingw32.static.posix/lib/x64" -L"d:/rtools45/x86_64-w64-mingw32.static.posix/lib" -L"D:/RCompile/recent/R-4.5.3/bin/x64" -lR ; \ g++ -shared -s -static-libgcc -o file1a7d4180a5c6.dll tmp.def file1a7d4180a5c6.o "D:/RCompile/CRANpkg/lib/4.5/rstan/lib/x64/libStanServices.a" -L"D:/RCompile/CRANpkg/lib/4.5/StanHeaders/libs/x64" -lStanHeaders -L"D:/RCompile/CRANpkg/lib/4.5/RcppParallel/lib/x64" -ltbb -LD:/RCompile/CRANpkg/lib/4.5/RcppParallel/libs/x64 -lRcppParallel -LD:/RCompile/CRANpkg/lib/4.5/RcppParallel/lib/x64 -ltbb -ltbbmalloc -L"d:/rtools45/x86_64-w64-mingw32.static.posix/lib/x64" -L"d:/rtools45/x86_64-w64-mingw32.static.posix/lib" -L"D:/RCompile/recent/R-4.5.3/bin/x64" -lR ; \ rm -f tmp.def; \ fi \ fi make[1]: Leaving directory '/d/temp/2026_10_14_01_50_00_30378/RtmpiMs6e9' Saving _problems/test-priors-50.R [ FAIL 4 | WARN 0 | SKIP 0 | PASS 84 ] ══ Failed tests ════════════════════════════════════════════════════════════════ ── Error ('test-data-input.R:60:3'): fitting with a plain matrix runs end to end without error (all four models) ── Error in `compileCode(f, code, language = language, verbose = verbose)`: odel1a7d4160551e0__namespace::model1a7d4160551e0_; BaseRNG = boost::random::additive_combine_engine<boost::random::linear_congruential_engine<unsigned int, 40014, 0, 2147483563>, boost::random::linear_congruential_engine<unsigned int, 40692, 0, 2147483399> >]' 22 | return 0.5 * z.p.transpose() * z.inv_e_metric_ * z.p; D:/RCompile/CRANpkg/lib/4.5/StanHeaders/include/src/stan/mcmc/hmc/hamiltonians/dense_e_metric.hpp:21:0: required from here 21 | double T(dense_e_point& z) { D:/RCompile/CRANpkg/lib/4.5/RcppEigen/include/Eigen/src/Core/DenseCoeffsBase.h:654:74: warning: ignoring attributes on template argument 'Eigen::internal::packet_traits<double>::type' {aka '__m128d'} [-Wignored-attributes] 654 | return internal::first_aligned<int(unpacket_traits<DefaultPacketType>::alignment),Derived>(m); | ^~~~~~~~~ make[1]: *** [D:/RCompile/recent/R-4.5.3/etc/x64/Makeconf:302: file1a7d436b870c.o] Error 1 Backtrace: ▆ 1. ├─testthat::expect_s3_class(...) at test-data-input.R:60:3 2. │ └─testthat::quasi_label(enquo(object)) 3. │ └─rlang::eval_bare(expr, quo_get_env(quo)) 4. ├─base::suppressWarnings(...) 5. │ └─base::withCallingHandlers(...) 6. └─GMLTM::GMLTM(...) 7. └─rstan::stan_model(stan_file) 8. └─rstan:::cxxfunctionplus(...) 9. ├─pkgbuild::with_build_tools(...) 10. │ └─pkgbuild:::withr_with_path(rtools_path(), code) 11. │ └─base::force(code) 12. └─inline::cxxfunction(...) 13. └─inline:::compileCode(f, code, language = language, verbose = verbose) ── Error ('test-data-input.R:60:3'): fitting with a plain matrix runs end to end without error (all four models) ── Error in `sink(type = "output")`: invalid connection Backtrace: ▆ 1. ├─testthat::expect_s3_class(...) at test-data-input.R:60:3 2. │ └─testthat::quasi_label(enquo(object)) 3. │ └─rlang::eval_bare(expr, quo_get_env(quo)) 4. ├─base::suppressWarnings(...) 5. │ └─base::withCallingHandlers(...) 6. └─GMLTM::GMLTM(...) 7. └─rstan::stan_model(stan_file) 8. └─rstan:::cxxfunctionplus(...) 9. └─base::sink(type = "output") ── Error ('test-priors.R:46:3'): GMLTM fits successfully with priors$alpha$family = 'lognormal' ── Error in `compileCode(f, code, language = language, verbose = verbose)`: odel1a7d46cc6319a__namespace::model1a7d46cc6319a_; BaseRNG = boost::random::additive_combine_engine<boost::random::linear_congruential_engine<unsigned int, 40014, 0, 2147483563>, boost::random::linear_congruential_engine<unsigned int, 40692, 0, 2147483399> >]' 22 | return 0.5 * z.p.transpose() * z.inv_e_metric_ * z.p; D:/RCompile/CRANpkg/lib/4.5/StanHeaders/include/src/stan/mcmc/hmc/hamiltonians/dense_e_metric.hpp:21:0: required from here 21 | double T(dense_e_point& z) { D:/RCompile/CRANpkg/lib/4.5/RcppEigen/include/Eigen/src/Core/DenseCoeffsBase.h:654:74: warning: ignoring attributes on template argument 'Eigen::internal::packet_traits<double>::type' {aka '__m128d'} [-Wignored-attributes] 654 | return internal::first_aligned<int(unpacket_traits<DefaultPacketType>::alignment),Derived>(m); | ^~~~~~~~~ make[1]: *** [D:/RCompile/recent/R-4.5.3/etc/x64/Makeconf:302: file1a7d4180a5c6.o] Error 1 Backtrace: ▆ 1. ├─base::suppressWarnings(...) at test-priors.R:46:3 2. │ └─base::withCallingHandlers(...) 3. └─GMLTM::GMLTM(...) 4. └─rstan::stan_model(stan_file) 5. └─rstan:::cxxfunctionplus(...) 6. ├─pkgbuild::with_build_tools(...) 7. │ └─pkgbuild:::withr_with_path(rtools_path(), code) 8. │ └─base::force(code) 9. └─inline::cxxfunction(...) 10. └─inline:::compileCode(f, code, language = language, verbose = verbose) ── Error ('test-priors.R:46:3'): GMLTM fits successfully with priors$alpha$family = 'lognormal' ── Error in `sink(type = "output")`: invalid connection Backtrace: ▆ 1. ├─base::suppressWarnings(...) at test-priors.R:46:3 2. │ └─base::withCallingHandlers(...) 3. └─GMLTM::GMLTM(...) 4. └─rstan::stan_model(stan_file) 5. └─rstan:::cxxfunctionplus(...) 6. └─base::sink(type = "output") [ FAIL 4 | WARN 0 | SKIP 0 | PASS 84 ] Error: ! Test failures. Execution halted Flavor: r-oldrel-windows-x86_64